Reaction Details
TargetD(2) dopamine receptor
LigandBDBM81486
Substrate/Competitorn/a
Meas. Tech.ChEMBL_1913690 (CHEMBL4416273)
Ki 0.724436±n/a nM
Citation Fyfe, TJKellam, BSykes, DACapuano, BScammells, PJLane, JRCharlton, SJMistry, SN Structure-Kinetic Profiling of Haloperidol Analogues at the Human Dopamine D J Med Chem62:9488-9520 (2019) 
 
D(2) dopamine receptor
Name:D(2) dopamine receptor
Type:Cell-surface receptors
Mol. Mass.:50647.10
Organism:Homo sapiens (Human)
Description:P14416
Residue:443
BDBM81486
NameBDBM81486
Synonyms:CAS_1050-79-9 NSC_4249
TypeSmall organic molecule
Emp. Form.C22H26FNO2
Mol. Mass.355.4457
SMILESCc1ccc(cc1)C1(O)CCN(CCCC(=O)c2ccc(F)cc2)CC1