Reaction Details
TargetD(2) dopamine receptor
LigandBDBM50530680
Substrate/Competitorn/a
Meas. Tech.ChEMBL_1913690 (CHEMBL4416273)
Ki 0.120226±n/a nM
Citation Fyfe, TJKellam, BSykes, DACapuano, BScammells, PJLane, JRCharlton, SJMistry, SN Structure-Kinetic Profiling of Haloperidol Analogues at the Human Dopamine D J Med Chem62:9488-9520 (2019) 
 
D(2) dopamine receptor
Name:D(2) dopamine receptor
Type:Cell-surface receptors
Mol. Mass.:50647.10
Organism:Homo sapiens (Human)
Description:P14416
Residue:443
BDBM50530680
NameBDBM50530680
Synonyms:CHEMBL4570273
TypeSmall organic molecule
Emp. Form.C21H22Cl2FNO2
Mol. Mass.410.309
SMILESOC1(CCN(CCCC(=O)c2ccc(F)cc2)CC1)c1cccc(Cl)c1Cl