Reaction Details
TargetD(2) dopamine receptor
LigandBDBM50530709
Substrate/Competitorn/a
Meas. Tech.ChEMBL_1913690 (CHEMBL4416273)
Ki 1.000000±n/a nM
Citation Fyfe, TJKellam, BSykes, DACapuano, BScammells, PJLane, JRCharlton, SJMistry, SN Structure-Kinetic Profiling of Haloperidol Analogues at the Human Dopamine D J Med Chem62:9488-9520 (2019) 
 
D(2) dopamine receptor
Name:D(2) dopamine receptor
Type:Cell-surface receptors
Mol. Mass.:50647.10
Organism:Homo sapiens (Human)
Description:P14416
Residue:443
BDBM50530709
NameBDBM50530709
Synonyms:CHEMBL4455788
TypeSmall organic molecule
Emp. Form.C21H23ClFNO2
Mol. Mass.375.864
SMILESOC1(CCN(CCCC(=O)c2ccc(F)cc2)CC1)c1cccc(Cl)c1