Reaction Details
TargetD(2) dopamine receptor
LigandBDBM50530676
Substrate/Competitorn/a
Meas. Tech.ChEMBL_1913690 (CHEMBL4416273)
Ki 0.158489±n/a nM
Citation Fyfe, TJKellam, BSykes, DACapuano, BScammells, PJLane, JRCharlton, SJMistry, SN Structure-Kinetic Profiling of Haloperidol Analogues at the Human Dopamine D J Med Chem62:9488-9520 (2019) 
 
D(2) dopamine receptor
Name:D(2) dopamine receptor
Type:Cell-surface receptors
Mol. Mass.:50647.10
Organism:Homo sapiens (Human)
Description:P14416
Residue:443
BDBM50530676
NameBDBM50530676
Synonyms:CHEMBL4528835
TypeSmall organic molecule
Emp. Form.C22H23ClFNO
Mol. Mass.371.876
SMILESFc1ccc(cc1)C(=O)CCCN1CCC2(CC2C1)c1ccc(Cl)cc1