Reaction Details
TargetD(2) dopamine receptor
LigandBDBM50530705
Substrate/Competitorn/a
Meas. Tech.ChEMBL_1913690 (CHEMBL4416273)
Ki 0.052481±n/a nM
Citation Fyfe, TJKellam, BSykes, DACapuano, BScammells, PJLane, JRCharlton, SJMistry, SN Structure-Kinetic Profiling of Haloperidol Analogues at the Human Dopamine D J Med Chem62:9488-9520 (2019) 
 
D(2) dopamine receptor
Name:D(2) dopamine receptor
Type:Cell-surface receptors
Mol. Mass.:50647.10
Organism:Homo sapiens (Human)
Description:P14416
Residue:443
BDBM50530705
NameBDBM50530705
Synonyms:CHEMBL4451384
TypeSmall organic molecule
Emp. Form.C23H25ClFNO2
Mol. Mass.401.902
SMILES[H][C@]12CC[C@]([H])(CC(O)(C1)c1ccc(Cl)cc1)N2CCCC(=O)c1ccc(F)cc1