Reaction Details
TargetD(2) dopamine receptor
LigandBDBM50362868
Substrate/Competitorn/a
Meas. Tech.ChEMBL_1913690 (CHEMBL4416273)
Ki 1.1±n/a nM
Citation Fyfe, TJKellam, BSykes, DACapuano, BScammells, PJLane, JRCharlton, SJMistry, SN Structure-Kinetic Profiling of Haloperidol Analogues at the Human Dopamine D J Med Chem62:9488-9520 (2019) 
 
D(2) dopamine receptor
Name:D(2) dopamine receptor
Type:Cell-surface receptors
Mol. Mass.:50647.10
Organism:Homo sapiens (Human)
Description:P14416
Residue:443
BDBM50362868
NameBDBM50362868
Synonyms:CHEMBL1940404
TypeSmall organic molecule
Emp. Form.C20H23ClFNO2
Mol. Mass.363.854
SMILESOC1(CCN(CCCOc2ccc(F)cc2)CC1)c1ccc(Cl)cc1