Reaction Details
TargetAdenosine receptor A1
LigandBDBM50086163
Substrate/Competitorn/a
Meas. Tech.ChEMBL_29464 (CHEMBL642193)
Ki 3.94±n/a nM
Citation Kim, YCJi, XMelman, NLinden, JJacobson, KA Anilide derivatives of an 8-phenylxanthine carboxylic congener are highly potent and selective antagonists at human A(2B) adenosine receptors. J Med Chem43:1165-72 (2000) Adenosine receptor A1
Name:Adenosine receptor A1
Type:Protein
Mol. Mass.:36704.13
Organism:Rattus norvegicus (rat)
Description:n/a
Residue:326
BDBM50086163
NameBDBM50086163
Synonyms:CHEMBL17294 | N-(3,4-Dimethyl-2,5-dioxo-2,5-dihydro-pyrrol-1-yl)-3-[4-(2,6-dioxo-1,3-dipropyl-2,3,6,7-tetrahydro-1H-purin-8-yl)-phenyl]-acrylamide
TypeSmall organic molecule
Emp. Form.C26H28N6O5
Mol. Mass.504.5377
SMILESCCCn1c2nc([nH]c2c(=O)n(CCC)c1=O)-c1ccc(C=CC(=O)NN2C(=O)C(C)=C(C)C2=O)cc1