Reaction Details
TargetAdenosine receptor A2a
LigandBDBM50086182
Substrate/Competitorn/a
Meas. Tech.ChEMBL_31379 (CHEMBL644471)
Ki 16.6±n/a nM
Citation Kim, YCJi, XMelman, NLinden, JJacobson, KA Anilide derivatives of an 8-phenylxanthine carboxylic congener are highly potent and selective antagonists at human A(2B) adenosine receptors. J Med Chem43:1165-72 (2000) Adenosine receptor A2a
Name:Adenosine receptor A2a
Type:G Protein-Coupled Receptor (GPCR)
Mol. Mass.:44716.46
Organism:Homo sapiens (Human)
Description:P29274
Residue:412
BDBM50086182
NameBDBM50086182
Synonyms:2-(4-(2,4-dioxo-1,3-dipropyl-2,3,4,5-tetrahydro-1H-pyrrolo[3,2-d]pyrimidin-6-yl)phenoxy)-N-(4-fluorophenyl)acetamide CHEMBL16929
TypeSmall organic molecule
Emp. Form.C25H26FN5O4
Mol. Mass.479.5034
SMILESCCCn1c2nc([nH]c2c(=O)n(CCC)c1=O)-c1ccc(OCC(=O)Nc2ccc(F)cc2)cc1