Reaction Details
TargetTyrosine-protein kinase JAK3
LigandBDBM50311656
Substrate/Competitorn/a
Meas. Tech.ChEMBL_1913890 (CHEMBL4416473)
IC50 1.7±n/a nM
Citation Bach, JEastwood, PGonzález, JGómez, EAlonso, JAFonquerna, SLozoya, EOrellana, AMaldonado, MCalaf, EAlbertí, JPérez, JAndrés, APrats, NCarreño, CCalama, EDe Alba, JCalbet, MMiralpeix, MRamis, I Identification of 2-Imidazopyridine and 2-Aminopyridone Purinones as Potent Pan-Janus Kinase (JAK) Inhibitors for the Inhaled Treatment of Respiratory Diseases. J Med Chem62:9045-9060 (2019) 
 
Tyrosine-protein kinase JAK3
Name:Tyrosine-protein kinase JAK3
Type:Protein
Mol. Mass.:125111.08
Organism:Homo sapiens (Human)
Description:P52333
Residue:1124
BDBM50311656
NameBDBM50311656
Synonyms:2-(6-fluoro-1H-benzo[d]imidazol-1-yl)-9-(8-fluorochroman-4-yl)-7H-purin-8(9H)-one | CHEMBL1079593
TypeSmall organic molecule
Emp. Form.C21H14F2N6O2
Mol. Mass.420.3717
SMILESFc1ccc2ncn(-c3ncc4[nH]c(=O)n([C@@H]5CCOc6c(F)cccc56)c4n3)c2c1