Reaction Details
TargetrRNA adenine N-6-methyltransferase
LigandBDBM50086578
Substrate/Competitorn/a
Meas. Tech.ChEBML_67532
Ki>100000±n/a nM
Citation Hanessian, SSgarbi, PW Design and synthesis of mimics of S-adenosyl-L-homocysteine as potential inhibitors of erythromycin methyltransferases. Bioorg Med Chem Lett10:433-7 (2000) rRNA adenine N-6-methyltransferase
Name:rRNA adenine N-6-methyltransferase
Type:PROTEIN
Mol. Mass.:28804.82
Organism:Streptococcus pneumoniae
Description:ChEMBL_67532
Residue:245
BDBM50086578
NameBDBM50086578
Synonyms:(1R,2S,3R,5S)-5-[4-Amino-6-(indan-2-ylamino)-[1,3,5]triazin-2-yl]-3-benzyloxy-cyclohexane-1,2-diol | CHEMBL342405
TypeSmall organic molecule
Emp. Form.C25H29N5O3
Mol. Mass.447.5295
SMILESNc1nc(NC2Cc3ccccc3C2)nc(n1)[C@H]1C[C@@H](O)[C@H](O)[C@@H](C1)OCc1ccccc1