Reaction Details
TargetrRNA adenine N-6-methyltransferase
LigandBDBM50009672
Substrate/Competitorn/a
Meas. Tech.ChEBML_67532
Ki 40000±n/a nM
Citation Hanessian, SSgarbi, PW Design and synthesis of mimics of S-adenosyl-L-homocysteine as potential inhibitors of erythromycin methyltransferases. Bioorg Med Chem Lett10:433-7 (2000) rRNA adenine N-6-methyltransferase
Name:rRNA adenine N-6-methyltransferase
Type:PROTEIN
Mol. Mass.:28804.82
Organism:Streptococcus pneumoniae
Description:ChEMBL_67532
Residue:245
BDBM50009672
NameBDBM50009672
Synonyms:AdoHcy S-(5'-adenosyl)-L-homocysteine S-[1-(adenin-9-yl)-1,5-dideoxy-beta-D-ribofuranos-5-yl]-L-homocysteine SAH US9175331, 1 | US9333217, S-Adenosyl-L-homocysteine (SAH)
TypeSmall organic molecule
Emp. Form.C14H20N6O5S
Mol. Mass.384.411
SMILESN[C@@H](CCSC[C@H]1O[C@H]([C@H](O)[C@@H]1O)n1cnc2c(N)ncnc12)C(O)=O