Reaction Details
TargetrRNA adenine N-6-methyltransferase
LigandBDBM50086580
Substrate/Competitorn/a
Meas. Tech.ChEBML_67532
Ki>100000±n/a nM
Citation Hanessian, SSgarbi, PW Design and synthesis of mimics of S-adenosyl-L-homocysteine as potential inhibitors of erythromycin methyltransferases. Bioorg Med Chem Lett10:433-7 (2000) rRNA adenine N-6-methyltransferase
Name:rRNA adenine N-6-methyltransferase
Type:PROTEIN
Mol. Mass.:28804.82
Organism:Streptococcus pneumoniae
Description:ChEMBL_67532
Residue:245
BDBM50086580
NameBDBM50086580
Synonyms:(3R,4S,5S)-2-[4-Amino-6-(indan-2-ylamino)-[1,3,5]triazin-2-ylmethyl]-5-phenylsulfanylmethyl-tetrahydro-furan-3,4-diol | CHEMBL136759
TypeSmall organic molecule
Emp. Form.C24H27N5O3S
Mol. Mass.465.568
SMILESNc1nc(CC2O[C@H](CSc3ccccc3)[C@@H](O)[C@H]2O)nc(NC2Cc3ccccc3C2)n1