Reaction Details
TargetScytalone dehydratase
LigandBDBM50086741
Substrate/Competitorn/a
Meas. Tech.ChEBML_199538
Ki 0.030±n/a nM
Citation Liao, DIBasarab, GSGatenby, AAJordan, DB Selection of a potent inhibitor of trihydroxynaphthalene reductase by sorting disease control data. Bioorg Med Chem Lett10:491-4 (2000) Scytalone dehydratase
Name:Scytalone dehydratase
Type:PROTEIN
Mol. Mass.:20248.63
Organism:Magnaporthe grisea
Description:ChEMBL_199536
Residue:172
BDBM50086741
NameBDBM50086741
Synonyms:((1RS,3SR)-2,2-DICHLORO-N-[(R)-1-(4-CHLOROPHENYL)ETHYL]-1-ETHYL-3-METHYLCYCLOPROPANECARBOXAMIDE CHEMBL147792
TypeSmall organic molecule
Emp. Form.C15H18Cl3NO
Mol. Mass.334.669
SMILESCC[C@]1([C@@H](C)C1(Cl)Cl)C(=O)N[C@H](C)c1ccc(Cl)cc1