Reaction Details
TargetScytalone dehydratase
LigandBDBM50086743
Substrate/Competitorn/a
Meas. Tech.ChEBML_199538
Ki 6.4±n/a nM
Citation Liao, DIBasarab, GSGatenby, AAJordan, DB Selection of a potent inhibitor of trihydroxynaphthalene reductase by sorting disease control data. Bioorg Med Chem Lett10:491-4 (2000) Scytalone dehydratase
Name:Scytalone dehydratase
Type:PROTEIN
Mol. Mass.:20248.63
Organism:Magnaporthe grisea
Description:ChEMBL_199536
Residue:172
BDBM50086743
NameBDBM50086743
Synonyms:CHEMBL358101 | N-(2,5-Difluoro-phenyl)-4-{3-[(E)-(3-phenyl-acryloyl)]-thioureido}-benzenesulfonamide
TypeSmall organic molecule
Emp. Form.C22H17F2N3O3S2
Mol. Mass.473.515
SMILESFc1ccc(F)c(NS(=O)(=O)c2ccc(NC(=S)NC(=O)C=Cc3ccccc3)cc2)c1