Reaction Details
TargetEpidermal growth factor receptor
LigandBDBM50087067
Substrate/Competitorn/a
Meas. Tech.ChEMBL_64445 (CHEMBL674020)
IC50 0.78±n/a nM
Citation Smaill, JBRewcastle, GWLoo, JAGreis, KDChan, OHReyner, ELLipka, EShowalter, HDVincent, PWElliott, WLDenny, WA Tyrosine kinase inhibitors. 17. Irreversible inhibitors of the epidermal growth factor receptor: 4-(phenylamino)quinazoline- and 4-(phenylamino)pyrido[3,2-d]pyrimidine-6-acrylamides bearing additional solubilizing functions. J Med Chem43:1380-97 (2001) Epidermal growth factor receptor
Name:Epidermal growth factor receptor
Type:Receptor Kinase Domain
Mol. Mass.:134279.59
Organism:Homo sapiens (Human)
Description:P00533
Residue:1210
BDBM50087067
NameBDBM50087067
Synonyms:CHEMBL31326 | N-[4-(3-Bromo-phenylamino)-7-(3-diethylamino-propylsulfanyl)-quinazolin-6-yl]-acrylamide
TypeSmall organic molecule
Emp. Form.C24H28BrN5OS
Mol. Mass.514.481
SMILESCCN(CC)CCCSc1cc2ncnc(Nc3cccc(Br)c3)c2cc1NC(=O)C=C