Reaction Details
TargetEpidermal growth factor receptor
LigandBDBM50087068
Substrate/Competitorn/a
Meas. Tech.ChEMBL_64444 (CHEMBL674019)
IC50 18±n/a nM
Citation Smaill, JBRewcastle, GWLoo, JAGreis, KDChan, OHReyner, ELLipka, EShowalter, HDVincent, PWElliott, WLDenny, WA Tyrosine kinase inhibitors. 17. Irreversible inhibitors of the epidermal growth factor receptor: 4-(phenylamino)quinazoline- and 4-(phenylamino)pyrido[3,2-d]pyrimidine-6-acrylamides bearing additional solubilizing functions. J Med Chem43:1380-97 (2001) Epidermal growth factor receptor
Name:Epidermal growth factor receptor
Type:Receptor Kinase Domain
Mol. Mass.:134279.59
Organism:Homo sapiens (Human)
Description:P00533
Residue:1210
BDBM50087068
NameBDBM50087068
Synonyms:CHEMBL31622 | N-{7-[3-(4-Methyl-piperazin-1-yl)-propoxy]-4-m-tolylamino-quinazolin-6-yl}-acrylamide
TypeSmall organic molecule
Emp. Form.C26H32N6O2
Mol. Mass.460.5713
SMILESCN1CCN(CCCOc2cc3ncnc(Nc4cccc(C)c4)c3cc2NC(=O)C=C)CC1