Reaction Details
TargetEpidermal growth factor receptor
LigandBDBM50087070
Substrate/Competitorn/a
Meas. Tech.ChEMBL_64444 (CHEMBL674019)
IC50 3±n/a nM
Citation Smaill, JBRewcastle, GWLoo, JAGreis, KDChan, OHReyner, ELLipka, EShowalter, HDVincent, PWElliott, WLDenny, WA Tyrosine kinase inhibitors. 17. Irreversible inhibitors of the epidermal growth factor receptor: 4-(phenylamino)quinazoline- and 4-(phenylamino)pyrido[3,2-d]pyrimidine-6-acrylamides bearing additional solubilizing functions. J Med Chem43:1380-97 (2001) Epidermal growth factor receptor
Name:Epidermal growth factor receptor
Type:Receptor Kinase Domain
Mol. Mass.:134279.59
Organism:Homo sapiens (Human)
Description:P00533
Residue:1210
BDBM50087070
NameBDBM50087070
Synonyms:CHEMBL32844 | N-{4-(3-Bromo-phenylamino)-7-[3-(4-methyl-piperazin-1-yl)-propoxy]-quinazolin-6-yl}-acrylamide
TypeSmall organic molecule
Emp. Form.C25H29BrN6O2
Mol. Mass.525.441
SMILESCN1CCN(CCCOc2cc3ncnc(Nc4cccc(Br)c4)c3cc2NC(=O)C=C)CC1