Reaction Details
TargetEpidermal growth factor receptor
LigandBDBM50087072
Substrate/Competitorn/a
Meas. Tech.ChEMBL_64445 (CHEMBL674020)
IC50 20±n/a nM
Citation Smaill, JBRewcastle, GWLoo, JAGreis, KDChan, OHReyner, ELLipka, EShowalter, HDVincent, PWElliott, WLDenny, WA Tyrosine kinase inhibitors. 17. Irreversible inhibitors of the epidermal growth factor receptor: 4-(phenylamino)quinazoline- and 4-(phenylamino)pyrido[3,2-d]pyrimidine-6-acrylamides bearing additional solubilizing functions. J Med Chem43:1380-97 (2001) Epidermal growth factor receptor
Name:Epidermal growth factor receptor
Type:Receptor Kinase Domain
Mol. Mass.:134279.59
Organism:Homo sapiens (Human)
Description:P00533
Residue:1210
BDBM50087072
NameBDBM50087072
Synonyms:CHEMBL31630 | N-[4-(3-Chloro-4-fluoro-phenylamino)-7-(3-morpholin-4-yl-propoxy)-pyrido[3,2-d]pyrimidin-6-yl]-N-methyl-acrylamide
TypeSmall organic molecule
Emp. Form.C24H26ClFN6O3
Mol. Mass.500.953
SMILESCN(C(=O)C=C)c1nc2c(Nc3ccc(F)c(Cl)c3)ncnc2cc1OCCCN1CCOCC1