Reaction Details
TargetEpidermal growth factor receptor
LigandBDBM50087074
Substrate/Competitorn/a
Meas. Tech.ChEMBL_64445 (CHEMBL674020)
IC50 1.7±n/a nM
Citation Smaill, JBRewcastle, GWLoo, JAGreis, KDChan, OHReyner, ELLipka, EShowalter, HDVincent, PWElliott, WLDenny, WA Tyrosine kinase inhibitors. 17. Irreversible inhibitors of the epidermal growth factor receptor: 4-(phenylamino)quinazoline- and 4-(phenylamino)pyrido[3,2-d]pyrimidine-6-acrylamides bearing additional solubilizing functions. J Med Chem43:1380-97 (2001) Epidermal growth factor receptor
Name:Epidermal growth factor receptor
Type:Receptor Kinase Domain
Mol. Mass.:134279.59
Organism:Homo sapiens (Human)
Description:P00533
Residue:1210
BDBM50087074
NameBDBM50087074
Synonyms:CHEMBL32079 | N-{4-(3-Chloro-4-fluoro-phenylamino)-7-[2-(4-hydroxy-butoxy)-ethoxy]-quinazolin-6-yl}-acrylamide
TypeSmall organic molecule
Emp. Form.C23H24ClFN4O4
Mol. Mass.474.912
SMILESOCCCCOCCOc1cc2ncnc(Nc3ccc(F)c(Cl)c3)c2cc1NC(=O)C=C