Reaction Details
TargetReceptor tyrosine-protein kinase erbB-2
LigandBDBM50087073
Substrate/Competitorn/a
Meas. Tech.ChEMBL_65260 (CHEMBL673951)
IC50 6.4±n/a nM
Citation Smaill, JBRewcastle, GWLoo, JAGreis, KDChan, OHReyner, ELLipka, EShowalter, HDVincent, PWElliott, WLDenny, WA Tyrosine kinase inhibitors. 17. Irreversible inhibitors of the epidermal growth factor receptor: 4-(phenylamino)quinazoline- and 4-(phenylamino)pyrido[3,2-d]pyrimidine-6-acrylamides bearing additional solubilizing functions. J Med Chem43:1380-97 (2001) Receptor tyrosine-protein kinase erbB-2
Name:Receptor tyrosine-protein kinase erbB-2
Type:n/a
Mol. Mass.:137894.47
Organism:Homo sapiens (Human)
Description:P04626
Residue:1255
BDBM50087073
NameBDBM50087073
Synonyms:CHEMBL31419 | N-[4-(3-Bromo-phenylamino)-7-(3-morpholin-4-yl-propoxy)-quinazolin-6-yl]-acrylamide
TypeSmall organic molecule
Emp. Form.C24H26BrN5O3
Mol. Mass.512.399
SMILESBrc1cccc(Nc2ncnc3cc(OCCCN4CCOCC4)c(NC(=O)C=C)cc23)c1