Reaction Details
TargetEpidermal growth factor receptor
LigandBDBM50087080
Substrate/Competitorn/a
Meas. Tech.ChEMBL_64445 (CHEMBL674020)
IC50 3±n/a nM
Citation Smaill, JBRewcastle, GWLoo, JAGreis, KDChan, OHReyner, ELLipka, EShowalter, HDVincent, PWElliott, WLDenny, WA Tyrosine kinase inhibitors. 17. Irreversible inhibitors of the epidermal growth factor receptor: 4-(phenylamino)quinazoline- and 4-(phenylamino)pyrido[3,2-d]pyrimidine-6-acrylamides bearing additional solubilizing functions. J Med Chem43:1380-97 (2001) Epidermal growth factor receptor
Name:Epidermal growth factor receptor
Type:Receptor Kinase Domain
Mol. Mass.:134279.59
Organism:Homo sapiens (Human)
Description:P00533
Residue:1210
BDBM50087080
NameBDBM50087080
Synonyms:CHEMBL286343 | N-[4-(3-Bromo-phenylamino)-7-(3-imidazol-1-yl-propoxy)-quinazolin-6-yl]-acrylamide
TypeSmall organic molecule
Emp. Form.C23H21BrN6O2
Mol. Mass.493.356
SMILESBrc1cccc(Nc2ncnc3cc(OCCCn4ccnc4)c(NC(=O)C=C)cc23)c1