Reaction Details
TargetEpidermal growth factor receptor
LigandBDBM50087071
Substrate/Competitorn/a
Meas. Tech.ChEMBL_64445 (CHEMBL674020)
IC50 6.6±n/a nM
Citation Smaill, JBRewcastle, GWLoo, JAGreis, KDChan, OHReyner, ELLipka, EShowalter, HDVincent, PWElliott, WLDenny, WA Tyrosine kinase inhibitors. 17. Irreversible inhibitors of the epidermal growth factor receptor: 4-(phenylamino)quinazoline- and 4-(phenylamino)pyrido[3,2-d]pyrimidine-6-acrylamides bearing additional solubilizing functions. J Med Chem43:1380-97 (2001) Epidermal growth factor receptor
Name:Epidermal growth factor receptor
Type:Receptor Kinase Domain
Mol. Mass.:134279.59
Organism:Homo sapiens (Human)
Description:P00533
Residue:1210
BDBM50087071
NameBDBM50087071
Synonyms:CHEMBL284326 | N-{4-(3-Chloro-4-fluoro-phenylamino)-7-[3-(4-methyl-piperazin-1-yl)-propoxy]-pyrido[3,2-d]pyrimidin-6-yl}-acrylamide
TypeSmall organic molecule
Emp. Form.C24H27ClFN7O2
Mol. Mass.499.968
SMILESCN1CCN(CCCOc2cc3ncnc(Nc4ccc(F)c(Cl)c4)c3nc2NC(=O)C=C)CC1