Reaction Details
TargetEpidermal growth factor receptor
LigandBDBM50087078
Substrate/Competitorn/a
Meas. Tech.ChEMBL_64444 (CHEMBL674019)
IC50 27±n/a nM
Citation Smaill, JBRewcastle, GWLoo, JAGreis, KDChan, OHReyner, ELLipka, EShowalter, HDVincent, PWElliott, WLDenny, WA Tyrosine kinase inhibitors. 17. Irreversible inhibitors of the epidermal growth factor receptor: 4-(phenylamino)quinazoline- and 4-(phenylamino)pyrido[3,2-d]pyrimidine-6-acrylamides bearing additional solubilizing functions. J Med Chem43:1380-97 (2001) Epidermal growth factor receptor
Name:Epidermal growth factor receptor
Type:Receptor Kinase Domain
Mol. Mass.:134279.59
Organism:Homo sapiens (Human)
Description:P00533
Residue:1210
BDBM50087078
NameBDBM50087078
Synonyms:CHEMBL27688 | N-[7-(3-Morpholin-4-yl-propoxy)-4-m-tolylamino-quinazolin-6-yl]-acrylamide
TypeSmall organic molecule
Emp. Form.C25H29N5O3
Mol. Mass.447.5295
SMILESCc1cccc(Nc2ncnc3cc(OCCCN4CCOCC4)c(NC(=O)C=C)cc23)c1