Reaction Details
TargetReceptor tyrosine-protein kinase erbB-2
LigandBDBM50087082
Substrate/Competitorn/a
Meas. Tech.ChEMBL_65260 (CHEMBL673951)
IC50 12±n/a nM
Citation Smaill, JBRewcastle, GWLoo, JAGreis, KDChan, OHReyner, ELLipka, EShowalter, HDVincent, PWElliott, WLDenny, WA Tyrosine kinase inhibitors. 17. Irreversible inhibitors of the epidermal growth factor receptor: 4-(phenylamino)quinazoline- and 4-(phenylamino)pyrido[3,2-d]pyrimidine-6-acrylamides bearing additional solubilizing functions. J Med Chem43:1380-97 (2001) Receptor tyrosine-protein kinase erbB-2
Name:Receptor tyrosine-protein kinase erbB-2
Type:n/a
Mol. Mass.:137894.47
Organism:Homo sapiens (Human)
Description:P04626
Residue:1255
BDBM50087082
NameBDBM50087082
Synonyms:CHEMBL417478 | N-[4-(3-Chloro-4-fluoro-phenylamino)-7-(4-morpholin-4-yl-but-1-enyl)-pyrido[3,2-d]pyrimidin-6-yl]-acrylamide
TypeSmall organic molecule
Emp. Form.C24H24ClFN6O2
Mol. Mass.482.938
SMILESFc1ccc(Nc2ncnc3cc(\C=C\CCN4CCOCC4)c(NC(=O)C=C)nc23)cc1Cl