Reaction Details
TargetEpidermal growth factor receptor
LigandBDBM50087066
Substrate/Competitorn/a
Meas. Tech.ChEMBL_64445 (CHEMBL674020)
IC50 2.7±n/a nM
Citation Smaill, JBRewcastle, GWLoo, JAGreis, KDChan, OHReyner, ELLipka, EShowalter, HDVincent, PWElliott, WLDenny, WA Tyrosine kinase inhibitors. 17. Irreversible inhibitors of the epidermal growth factor receptor: 4-(phenylamino)quinazoline- and 4-(phenylamino)pyrido[3,2-d]pyrimidine-6-acrylamides bearing additional solubilizing functions. J Med Chem43:1380-97 (2001) Epidermal growth factor receptor
Name:Epidermal growth factor receptor
Type:Receptor Kinase Domain
Mol. Mass.:134279.59
Organism:Homo sapiens (Human)
Description:P00533
Residue:1210
BDBM50087066
NameBDBM50087066
Synonyms:CHEMBL281543 | N-[4-(3-Chloro-4-fluoro-phenylamino)-7-(4-morpholin-4-yl-butyl)-pyrido[3,2-d]pyrimidin-6-yl]-acrylamide
TypeSmall organic molecule
Emp. Form.C24H26ClFN6O2
Mol. Mass.484.954
SMILESFc1ccc(Nc2ncnc3cc(CCCCN4CCOCC4)c(NC(=O)C=C)nc23)cc1Cl