Reaction Details
TargetEpidermal growth factor receptor
LigandBDBM50087073
Substrate/Competitorn/a
Meas. Tech.ChEMBL_64444 (CHEMBL674019)
IC50 5.3±n/a nM
Citation Smaill, JBRewcastle, GWLoo, JAGreis, KDChan, OHReyner, ELLipka, EShowalter, HDVincent, PWElliott, WLDenny, WA Tyrosine kinase inhibitors. 17. Irreversible inhibitors of the epidermal growth factor receptor: 4-(phenylamino)quinazoline- and 4-(phenylamino)pyrido[3,2-d]pyrimidine-6-acrylamides bearing additional solubilizing functions. J Med Chem43:1380-97 (2001) Epidermal growth factor receptor
Name:Epidermal growth factor receptor
Type:Receptor Kinase Domain
Mol. Mass.:134279.59
Organism:Homo sapiens (Human)
Description:P00533
Residue:1210
BDBM50087073
NameBDBM50087073
Synonyms:CHEMBL31419 | N-[4-(3-Bromo-phenylamino)-7-(3-morpholin-4-yl-propoxy)-quinazolin-6-yl]-acrylamide
TypeSmall organic molecule
Emp. Form.C24H26BrN5O3
Mol. Mass.512.399
SMILESBrc1cccc(Nc2ncnc3cc(OCCCN4CCOCC4)c(NC(=O)C=C)cc23)c1