Reaction Details
TargetEpidermal growth factor receptor
LigandBDBM50087083
Substrate/Competitorn/a
Meas. Tech.ChEMBL_64445 (CHEMBL674020)
IC50 27±n/a nM
Citation Smaill, JBRewcastle, GWLoo, JAGreis, KDChan, OHReyner, ELLipka, EShowalter, HDVincent, PWElliott, WLDenny, WA Tyrosine kinase inhibitors. 17. Irreversible inhibitors of the epidermal growth factor receptor: 4-(phenylamino)quinazoline- and 4-(phenylamino)pyrido[3,2-d]pyrimidine-6-acrylamides bearing additional solubilizing functions. J Med Chem43:1380-97 (2001) Epidermal growth factor receptor
Name:Epidermal growth factor receptor
Type:Receptor Kinase Domain
Mol. Mass.:134279.59
Organism:Homo sapiens (Human)
Description:P00533
Residue:1210
BDBM50087083
NameBDBM50087083
Synonyms:CHEMBL31369 | N-{4-[3-Bromo-4-(2-dimethylamino-ethoxy)-phenylamino]-quinazolin-6-yl}-acrylamide
TypeSmall organic molecule
Emp. Form.C21H22BrN5O2
Mol. Mass.456.336
SMILESCN(C)CCOc1ccc(Nc2ncnc3ccc(NC(=O)C=C)cc23)cc1Br