Reaction Details
TargetReceptor tyrosine-protein kinase erbB-2
LigandBDBM50077238
Substrate/Competitorn/a
Meas. Tech.ChEMBL_65260 (CHEMBL673951)
IC50 7.3±n/a nM
Citation Smaill, JBRewcastle, GWLoo, JAGreis, KDChan, OHReyner, ELLipka, EShowalter, HDVincent, PWElliott, WLDenny, WA Tyrosine kinase inhibitors. 17. Irreversible inhibitors of the epidermal growth factor receptor: 4-(phenylamino)quinazoline- and 4-(phenylamino)pyrido[3,2-d]pyrimidine-6-acrylamides bearing additional solubilizing functions. J Med Chem43:1380-97 (2001) Receptor tyrosine-protein kinase erbB-2
Name:Receptor tyrosine-protein kinase erbB-2
Type:n/a
Mol. Mass.:137894.47
Organism:Homo sapiens (Human)
Description:P04626
Residue:1255
BDBM50077238
NameBDBM50077238
Synonyms:CHEMBL280757 | N-[4-(3-Bromo-4-fluoro-phenylamino)-quinazolin-6-yl]-acrylamide
TypeSmall organic molecule
Emp. Form.C17H12BrFN4O
Mol. Mass.387.206
SMILESFc1ccc(Nc2ncnc3ccc(NC(=O)C=C)cc23)cc1Br