Reaction Details
TargetReceptor tyrosine-protein kinase erbB-2
LigandBDBM50077235
Substrate/Competitorn/a
Meas. Tech.ChEMBL_65260 (CHEMBL673951)
IC50 12±n/a nM
Citation Smaill, JBRewcastle, GWLoo, JAGreis, KDChan, OHReyner, ELLipka, EShowalter, HDVincent, PWElliott, WLDenny, WA Tyrosine kinase inhibitors. 17. Irreversible inhibitors of the epidermal growth factor receptor: 4-(phenylamino)quinazoline- and 4-(phenylamino)pyrido[3,2-d]pyrimidine-6-acrylamides bearing additional solubilizing functions. J Med Chem43:1380-97 (2001) Receptor tyrosine-protein kinase erbB-2
Name:Receptor tyrosine-protein kinase erbB-2
Type:n/a
Mol. Mass.:137894.47
Organism:Homo sapiens (Human)
Description:P04626
Residue:1255
BDBM50077235
NameBDBM50077235
Synonyms:CHEMBL28418 | N-[4-(3-Chloro-4-fluoro-phenylamino)-pyrido[3,2-d]pyrimidin-6-yl]-acrylamide
TypeSmall organic molecule
Emp. Form.C16H11ClFN5O
Mol. Mass.343.743
SMILESFc1ccc(Nc2ncnc3ccc(NC(=O)C=C)nc23)cc1Cl