Reaction Details
TargetReceptor tyrosine-protein kinase erbB-2
LigandBDBM50087071
Substrate/Competitorn/a
Meas. Tech.ChEMBL_65260 (CHEMBL673951)
IC50 182±n/a nM
Citation Smaill, JBRewcastle, GWLoo, JAGreis, KDChan, OHReyner, ELLipka, EShowalter, HDVincent, PWElliott, WLDenny, WA Tyrosine kinase inhibitors. 17. Irreversible inhibitors of the epidermal growth factor receptor: 4-(phenylamino)quinazoline- and 4-(phenylamino)pyrido[3,2-d]pyrimidine-6-acrylamides bearing additional solubilizing functions. J Med Chem43:1380-97 (2001) Receptor tyrosine-protein kinase erbB-2
Name:Receptor tyrosine-protein kinase erbB-2
Type:n/a
Mol. Mass.:137894.47
Organism:Homo sapiens (Human)
Description:P04626
Residue:1255
BDBM50087071
NameBDBM50087071
Synonyms:CHEMBL284326 | N-{4-(3-Chloro-4-fluoro-phenylamino)-7-[3-(4-methyl-piperazin-1-yl)-propoxy]-pyrido[3,2-d]pyrimidin-6-yl}-acrylamide
TypeSmall organic molecule
Emp. Form.C24H27ClFN7O2
Mol. Mass.499.968
SMILESCN1CCN(CCCOc2cc3ncnc(Nc4ccc(F)c(Cl)c4)c3nc2NC(=O)C=C)CC1