Reaction Details
TargetEpidermal growth factor receptor
LigandBDBM50087075
Substrate/Competitorn/a
Meas. Tech.ChEMBL_64444 (CHEMBL674019)
IC50 7.9±n/a nM
Citation Smaill, JBRewcastle, GWLoo, JAGreis, KDChan, OHReyner, ELLipka, EShowalter, HDVincent, PWElliott, WLDenny, WA Tyrosine kinase inhibitors. 17. Irreversible inhibitors of the epidermal growth factor receptor: 4-(phenylamino)quinazoline- and 4-(phenylamino)pyrido[3,2-d]pyrimidine-6-acrylamides bearing additional solubilizing functions. J Med Chem43:1380-97 (2001) Epidermal growth factor receptor
Name:Epidermal growth factor receptor
Type:Receptor Kinase Domain
Mol. Mass.:134279.59
Organism:Homo sapiens (Human)
Description:P00533
Residue:1210
BDBM50087075
NameBDBM50087075
Synonyms:CHEMBL31588 | N-[4-(3-Bromo-phenylamino)-7-(4-dimethylamino-butoxy)-quinazolin-6-yl]-acrylamide
TypeSmall organic molecule
Emp. Form.C23H26BrN5O2
Mol. Mass.484.389
SMILESCN(C)CCCCOc1cc2ncnc(Nc3cccc(Br)c3)c2cc1NC(=O)C=C