Reaction Details
TargetOxytocin receptor
LigandBDBM50087281
Substrate/Competitorn/a
Meas. Tech.ChEMBL_220998 (CHEMBL821744)
Ki 1430±n/a nM
Citation Bélec, LSlaninova, JLubell, WD A study of the relationship between biological activity and prolyl amide isomer geometry in oxytocin using 5-tert-butylproline to augment the Cys(6)-Pro(7) amide cis-isomer population. J Med Chem43:1448-55 (2000) Oxytocin receptor
Name:Oxytocin receptor
Type:Enzyme Catalytic Domain
Mol. Mass.:42889.28
Organism:RAT
Description:Oxytocin OXTR RAT::P70536
Residue:388
BDBM50087281
NameBDBM50087281
Synonyms:2N-(1-carbamoylmethylcarbamoyl-3-methylbutyl)-1-[6-amino-12-(sec-butyl)-15-(2-carbamoylethyl)-18-carbamoylmethyl-9-(4-hydroxybenzyl)-7,10,13,16,19-pentaoxo-3,4-dithia-8,11,14,17,20-pentaazacycloicosanylcarbonyl]-5-(tert-butyl)tetrahydro-1H-2-p | CHEMBL429161
TypeSmall organic molecule
Emp. Form.C47H74N12O12S2
Mol. Mass.1063.294
SMILESCC[C@H](C)[C@@H]1NC(=O)[C@H](Cc2ccc(O)cc2)NC(=O)[C@H](N)CSSC[C@H](NC(=O)[C@H](CC(N)=O)NC(=O)[C@H](CCC(N)=O)NC1=O)C(=O)N1[C@@H](CC[C@@H]1C(C)(C)C)C(=O)N[C@@H](CC(C)C)C(=O)NCC(N)=O