Reaction Details
TargetAMP deaminase 1
LigandBDBM50087317
Substrate/Competitorn/a
Meas. Tech.ChEMBL_31893 (CHEMBL640310)
Ki 18000±n/a nM
Citation Bookser, BCKasibhatla, SRAppleman, JRErion, MD AMP deaminase inhibitors. 2. Initial discovery of a non-nucleotide transition-state inhibitor series. J Med Chem43:1495-507 (2000) AMP deaminase 1
Name:AMP deaminase 1
Type:Protein
Mol. Mass.:90225.27
Organism:Homo sapiens (Human)
Description:n/a
Residue:780
BDBM50087317
NameBDBM50087317
Synonyms:3-Octyl-3,6,7,8-tetrahydro-imidazo[4,5-d][1,3]diazepin-8-ol 0.25H2O | CHEMBL290949
TypeSmall organic molecule
Emp. Form.C14H24N4O
Mol. Mass.264.3666
SMILESCCCCCCCCn1cnc2C(O)CNC=Nc12