Reaction Details
TargetAMP deaminase 1
LigandBDBM50087307
Substrate/Competitorn/a
Meas. Tech.ChEMBL_31893 (CHEMBL640310)
Ki 10000±n/a nM
Citation Bookser, BCKasibhatla, SRAppleman, JRErion, MD AMP deaminase inhibitors. 2. Initial discovery of a non-nucleotide transition-state inhibitor series. J Med Chem43:1495-507 (2000) AMP deaminase 1
Name:AMP deaminase 1
Type:Protein
Mol. Mass.:90225.27
Organism:Homo sapiens (Human)
Description:n/a
Residue:780
BDBM50087307
NameBDBM50087307
Synonyms:3-Heptyl-3,6,7,8-tetrahydro-imidazo[4,5-d][1,3]diazepin-8-ol | CHEMBL38218
TypeSmall organic molecule
Emp. Form.C13H22N4O
Mol. Mass.250.34
SMILESCCCCCCCn1cnc2C(O)CNC=Nc12