Reaction Details
TargetAMP deaminase 1
LigandBDBM50087313
Substrate/Competitorn/a
Meas. Tech.ChEMBL_31893 (CHEMBL640310)
Ki 8000±n/a nM
Citation Bookser, BCKasibhatla, SRAppleman, JRErion, MD AMP deaminase inhibitors. 2. Initial discovery of a non-nucleotide transition-state inhibitor series. J Med Chem43:1495-507 (2000) AMP deaminase 1
Name:AMP deaminase 1
Type:Protein
Mol. Mass.:90225.27
Organism:Homo sapiens (Human)
Description:n/a
Residue:780
BDBM50087313
NameBDBM50087313
Synonyms:8-(8-Hydroxy-7,8-dihydro-6H-imidazo[4,5-d][1,3]diazepin-3-yl)-octanoic acid | CHEMBL38305
TypeSmall organic molecule
Emp. Form.C14H22N4O3
Mol. Mass.294.3495
SMILESOC1CNC=Nc2c1ncn2CCCCCCCC(O)=O