Reaction Details
TargetAMP deaminase 1
LigandBDBM50087303
Substrate/Competitorn/a
Meas. Tech.ChEMBL_31893 (CHEMBL640310)
Ki 170000±n/a nM
Citation Bookser, BCKasibhatla, SRAppleman, JRErion, MD AMP deaminase inhibitors. 2. Initial discovery of a non-nucleotide transition-state inhibitor series. J Med Chem43:1495-507 (2000) AMP deaminase 1
Name:AMP deaminase 1
Type:Protein
Mol. Mass.:90225.27
Organism:Homo sapiens (Human)
Description:n/a
Residue:780
BDBM50087303
NameBDBM50087303
Synonyms:7-(8-Hydroxy-7,8-dihydro-6H-imidazo[4,5-d][1,3]diazepin-3-yl)-heptanenitrile | CHEMBL36937
TypeSmall organic molecule
Emp. Form.C13H19N5O
Mol. Mass.261.3229
SMILESOC1CNC=Nc2c1ncn2CCCCCCC#N