Reaction Details
TargetAdenosine deaminase
LigandBDBM50087346
Substrate/Competitorn/a
Meas. Tech.ChEMBL_30792 (CHEMBL873051)
Ki 130±n/a nM
Citation Kasibhatla, SRBookser, BCProbst, GAppleman, JRErion, MD AMP deaminase inhibitors. 3. SAR of 3-(carboxyarylalkyl)coformycin aglycon analogues. J Med Chem43:1508-18 (2000) Adenosine deaminase
Name:Adenosine deaminase
Type:Enzyme
Mol. Mass.:40910.44
Organism:Bos taurus (bovine)
Description:n/a
Residue:363
BDBM50087346
NameBDBM50087346
Synonyms:3-[3-(8-Hydroxy-7,8-dihydro-6H-imidazo[4,5-d][1,3]diazepin-3-yl)-propyl]-4-methoxy-benzoic acid methyl ester | CHEMBL290770
TypeSmall organic molecule
Emp. Form.C18H22N4O4
Mol. Mass.358.3917
SMILESCOC(=O)c1ccc(OC)c(CCCn2cnc3C(O)CNC=Nc23)c1