Reaction Details
TargetAdenosine deaminase
LigandBDBM50087381
Substrate/Competitorn/a
Meas. Tech.ChEMBL_30792 (CHEMBL873051)
Ki 320±n/a nM
Citation Kasibhatla, SRBookser, BCProbst, GAppleman, JRErion, MD AMP deaminase inhibitors. 3. SAR of 3-(carboxyarylalkyl)coformycin aglycon analogues. J Med Chem43:1508-18 (2000) Adenosine deaminase
Name:Adenosine deaminase
Type:Enzyme
Mol. Mass.:40910.44
Organism:Bos taurus (bovine)
Description:n/a
Residue:363
BDBM50087381
NameBDBM50087381
Synonyms:2-Fluoro-6-[3-(8-hydroxy-7,8-dihydro-6H-imidazo[4,5-d][1,3]diazepin-3-yl)-propyl]-benzoic acid methyl ester (0.25H2O) | CHEMBL35724
TypeSmall organic molecule
Emp. Form.C17H19FN4O3
Mol. Mass.346.3562
SMILESCOC(=O)c1c(F)cccc1CCCn1cnc2C(O)CNC=Nc12