Reaction Details
TargetAMP deaminase 3
LigandBDBM50087402
Substrate/Competitorn/a
Meas. Tech.ChEMBL_28867 (CHEMBL644199)
Ki 1200±n/a nM
Citation Bookser, BCKasibhatla, SRErion, MD AMP deaminase inhibitors. 4. Further N3-substituted coformycin aglycon analogues: N3-alkylmalonates as ribose 5'-monophosphate mimetics. J Med Chem43:1519-24 (2000) AMP deaminase 3
Name:AMP deaminase 3
Type:Protein
Mol. Mass.:88818.80
Organism:Homo sapiens (Human)
Description:n/a
Residue:767
BDBM50087402
NameBDBM50087402
Synonyms:6-(8-Hydroxy-7,8-dihydro-6H-imidazo[4,5-d][1,3]diazepin-3-yl)-2-methyl-2-(3-trifluoromethyl-benzyl)-hexanoic acid 1H2O.0.5CH3CO2H | CHEMBL291059
TypeSmall organic molecule
Emp. Form.C21H25F3N4O3
Mol. Mass.438.4434
SMILESCC(CCCCn1cnc2C(O)CNC=Nc12)(Cc1cccc(c1)C(F)(F)F)C(O)=O