Reaction Details
TargetAMP deaminase 3
LigandBDBM50087400
Substrate/Competitorn/a
Meas. Tech.ChEMBL_28867 (CHEMBL644199)
Ki 5200±n/a nM
Citation Bookser, BCKasibhatla, SRErion, MD AMP deaminase inhibitors. 4. Further N3-substituted coformycin aglycon analogues: N3-alkylmalonates as ribose 5'-monophosphate mimetics. J Med Chem43:1519-24 (2000) AMP deaminase 3
Name:AMP deaminase 3
Type:Protein
Mol. Mass.:88818.80
Organism:Homo sapiens (Human)
Description:n/a
Residue:767
BDBM50087400
NameBDBM50087400
Synonyms:2-[4-(8-Hydroxy-7,8-dihydro-6H-imidazo[4,5-d][1,3]diazepin-3-yl)-butyl]-2-methyl-malonic acid dibenzyl ester | CHEMBL284858
TypeSmall organic molecule
Emp. Form.C28H32N4O5
Mol. Mass.504.5775
SMILESCC(CCCCn1cnc2C(O)CNC=Nc12)(C(=O)OCc1ccccc1)C(=O)OCc1ccccc1