Reaction Details
TargetAMP deaminase 3
LigandBDBM50087406
Substrate/Competitorn/a
Meas. Tech.ChEMBL_28867 (CHEMBL644199)
Ki 6000±n/a nM
Citation Bookser, BCKasibhatla, SRErion, MD AMP deaminase inhibitors. 4. Further N3-substituted coformycin aglycon analogues: N3-alkylmalonates as ribose 5'-monophosphate mimetics. J Med Chem43:1519-24 (2000) AMP deaminase 3
Name:AMP deaminase 3
Type:Protein
Mol. Mass.:88818.80
Organism:Homo sapiens (Human)
Description:n/a
Residue:767
BDBM50087406
NameBDBM50087406
Synonyms:2-[4-(8-Hydroxy-7,8-dihydro-6H-imidazo[4,5-d][1,3]diazepin-3-yl)-butyl]-2-methyl-malonic acid (1H2O.1(C6H11)2NH) | CHEMBL284277
TypeSmall organic molecule
Emp. Form.C14H20N4O5
Mol. Mass.324.3324
SMILESCC(CCCCn1cnc2C(O)CNC=Nc12)(C(O)=O)C(O)=O