Reaction Details
TargetAMP deaminase 3
LigandBDBM50087416
Substrate/Competitorn/a
Meas. Tech.ChEMBL_28867 (CHEMBL644199)
Ki 44800±n/a nM
Citation Bookser, BCKasibhatla, SRErion, MD AMP deaminase inhibitors. 4. Further N3-substituted coformycin aglycon analogues: N3-alkylmalonates as ribose 5'-monophosphate mimetics. J Med Chem43:1519-24 (2000) AMP deaminase 3
Name:AMP deaminase 3
Type:Protein
Mol. Mass.:88818.80
Organism:Homo sapiens (Human)
Description:n/a
Residue:767
BDBM50087416
NameBDBM50087416
Synonyms:2-[4-(8-Hydroxy-7,8-dihydro-6H-imidazo[4,5-d][1,3]diazepin-3-yl)-butyl]-2-methyl-malonic acid diethyl ester | CHEMBL37325
TypeSmall organic molecule
Emp. Form.C18H28N4O5
Mol. Mass.380.4387
SMILESCCOC(=O)C(C)(CCCCn1cnc2C(O)CNC=Nc12)C(=O)OCC