Reaction Details
TargetAlpha-1A adrenergic receptor
LigandBDBM50087488
Substrate/Competitorn/a
Meas. Tech.ChEMBL_34033 (CHEMBL646286)
Ki 0.29±n/a nM
Citation Meyer, MDAltenbach, RJBasha, FZCarroll, WACondon, SElmore, SWKerwin, JFSippy, KBTietje, KWendt, MDHancock, AABrune, MEBuckner, SADrizin, I Structure-activity studies for a novel series of tricyclic substituted hexahydrobenz[e]isoindole alpha(1A) adrenoceptor antagonists as potential agents for the symptomatic treatment of benign prostatic hyperplasia (BPH). J Med Chem43:1586-603 (2000) Alpha-1A adrenergic receptor
Name:Alpha-1A adrenergic receptor
Type:Protein
Mol. Mass.:51620.15
Organism:Rattus norvegicus (Rat)
Description:P43140
Residue:466
BDBM50087488
NameBDBM50087488
Synonyms:3-[2-(6-Methoxy-1,3,3a,4,5,9b-hexahydro-benzo[e]isoindol-2-yl)-ethyl]-2,4-dioxo-1,2,3,4-tetrahydro-benzo[4,5]thieno[3,2-d]pyrimidine-7-carboxylic acid amide | CHEMBL291073
TypeSmall organic molecule
Emp. Form.C26H26N4O4S
Mol. Mass.490.574
SMILESCOc1cccc2[C@@H]3CN(CCn4c(=O)[nH]c5c6ccc(cc6sc5c4=O)C(N)=O)C[C@@H]3CCc12