Reaction Details
TargetBeta-2 adrenergic receptor
LigandBDBM50019059
Substrate/Competitorn/a
Meas. Tech.ChEMBL_38610 (CHEMBL652293)
Ki 260±n/a nM
Citation Lu, SFHerbert, BHaufe, GLaue, KWPadgett, WLOshunleti, ODaly, JWKirk, KL Syntheses of (R)- and (S)-2- and 6-fluoronorepinephrine and (R)- and (S)-2- and 6-fluoroepinephrine: effect of stereochemistry on fluorine-induced adrenergic selectivities. J Med Chem43:1611-9 (2000) Beta-2 adrenergic receptor
Name:Beta-2 adrenergic receptor
Type:PROTEIN
Mol. Mass.:46593.67
Organism:Canis familiaris
Description:ChEMBL_56504
Residue:415
BDBM50019059
NameBDBM50019059
Synonyms:(+/-)3-Fluoro-4-(1-hydroxy-2-methylamino-ethyl)-benzene-1,2-diol 3-Fluoro-4-(1-hydroxy-2-methylamino-ethyl)-benzene-1,2-diol(2-FEPI) | CHEMBL43711
TypeSmall organic molecule
Emp. Form.C9H12FNO3
Mol. Mass.201.1949
SMILESCNCC(O)c1ccc(O)c(O)c1F