Reaction Details
TargetBeta-1 adrenergic receptor
LigandBDBM50087517
Substrate/Competitorn/a
Meas. Tech.ChEMBL_37540 (CHEMBL647622)
Ki 19000±n/a nM
Citation Lu, SFHerbert, BHaufe, GLaue, KWPadgett, WLOshunleti, ODaly, JWKirk, KL Syntheses of (R)- and (S)-2- and 6-fluoronorepinephrine and (R)- and (S)-2- and 6-fluoroepinephrine: effect of stereochemistry on fluorine-induced adrenergic selectivities. J Med Chem43:1611-9 (2000) Beta-1 adrenergic receptor
Name:Beta-1 adrenergic receptor
Type:Protein
Mol. Mass.:50486.84
Organism:Rattus norvegicus (Rat)
Description:P18090
Residue:466
BDBM50087517
NameBDBM50087517
Synonyms:4-(2-Amino-ethyl)-3-fluoro-benzene-1,2-diol | CHEMBL40268
TypeSmall organic molecule
Emp. Form.C8H10FNO2
Mol. Mass.171.1689
SMILESNCCc1ccc(O)c(O)c1F