Reaction Details
TargetBeta-2 adrenergic receptor
LigandBDBM50087518
Substrate/Competitorn/a
Meas. Tech.ChEMBL_38610 (CHEMBL652293)
Ki 67±n/a nM
Citation Lu, SFHerbert, BHaufe, GLaue, KWPadgett, WLOshunleti, ODaly, JWKirk, KL Syntheses of (R)- and (S)-2- and 6-fluoronorepinephrine and (R)- and (S)-2- and 6-fluoroepinephrine: effect of stereochemistry on fluorine-induced adrenergic selectivities. J Med Chem43:1611-9 (2000) Beta-2 adrenergic receptor
Name:Beta-2 adrenergic receptor
Type:PROTEIN
Mol. Mass.:46593.67
Organism:Canis familiaris
Description:ChEMBL_56504
Residue:415
BDBM50087518
NameBDBM50087518
Synonyms:(R)4-(2-Amino-1-hydroxy-ethyl)-3-fluoro-benzene-1,2-diol CHEMBL295072
TypeSmall organic molecule
Emp. Form.C8H10FNO3
Mol. Mass.187.1683
SMILESNC[C@H](O)c1ccc(O)c(O)c1F