Reaction Details
TargetBeta-2 adrenergic receptor
LigandBDBM50087520
Substrate/Competitorn/a
Meas. Tech.ChEMBL_38610 (CHEMBL652293)
Ki 110±n/a nM
Citation Lu, SFHerbert, BHaufe, GLaue, KWPadgett, WLOshunleti, ODaly, JWKirk, KL Syntheses of (R)- and (S)-2- and 6-fluoronorepinephrine and (R)- and (S)-2- and 6-fluoroepinephrine: effect of stereochemistry on fluorine-induced adrenergic selectivities. J Med Chem43:1611-9 (2000) Beta-2 adrenergic receptor
Name:Beta-2 adrenergic receptor
Type:PROTEIN
Mol. Mass.:46593.67
Organism:Canis familiaris
Description:ChEMBL_56504
Residue:415
BDBM50087520
NameBDBM50087520
Synonyms:(R)3-Fluoro-4-(1-hydroxy-2-methylamino-ethyl)-benzene-1,2-diol | CHEMBL42370
TypeSmall organic molecule
Emp. Form.C9H12FNO3
Mol. Mass.201.1949
SMILESCNC[C@H](O)c1ccc(O)c(O)c1F