Reaction Details
TargetProthrombin
LigandBDBM50087528
Substrate/Competitorn/a
Meas. Tech.ChEBML_209232
Ki 4000±n/a nM
Citation Pruitt, JRPinto, DJEstrella, MJBostrom, LLKnabb, RMWong, PCWright, MRWexler, RR Isoxazolines and isoxazoles as factor Xa inhibitors. Bioorg Med Chem Lett10:685-9 (2000) Prothrombin
Name:Prothrombin
Type:Protein
Mol. Mass.:70029.57
Organism:Homo sapiens (Human)
Description:P00734
Residue:622
BDBM50087528
NameBDBM50087528
Synonyms:5-Amino-3-(3-carbamimidoyl-phenyl)-isoxazole-4-carboxylic acid (2'-sulfamoyl-biphenyl-4-yl)-amide | CHEMBL352197
TypeSmall organic molecule
Emp. Form.C23H20N6O4S
Mol. Mass.476.508
SMILESNC(=N)c1cccc(c1)-c1noc(N)c1C(=O)Nc1ccc(cc1)-c1ccccc1S(N)(=O)=O