Reaction Details
TargetCoagulation factor X
LigandBDBM50079247
Substrate/Competitorn/a
Meas. Tech.ChEBML_48820
Ki 11±n/a nM
Citation Pruitt, JRPinto, DJEstrella, MJBostrom, LLKnabb, RMWong, PCWright, MRWexler, RR Isoxazolines and isoxazoles as factor Xa inhibitors. Bioorg Med Chem Lett10:685-9 (2000) Coagulation factor X
Name:Coagulation factor X
Type:Enzyme
Mol. Mass.:54726.60
Organism:Homo sapiens (Human)
Description:n/a
Residue:488
BDBM50079247
NameBDBM50079247
Synonyms:3-(3-Carbamimidoyl-phenyl)-5-methyl-4,5-dihydro-isoxazole-5-carboxylic acid (2'-sulfamoyl-biphenyl-4-yl)-amide; TFA CHEMBL7967
TypeSmall organic molecule
Emp. Form.C24H23N5O4S
Mol. Mass.477.536
SMILESCC1(CC(=NO1)c1cccc(c1)C(N)=N)C(=O)Nc1ccc(cc1)-c1ccccc1S(N)(=O)=O