Reaction Details
TargetSerine protease 1
LigandBDBM50087536
Substrate/Competitorn/a
Meas. Tech.ChEBML_212523
Ki 25±n/a nM
Citation Pruitt, JRPinto, DJEstrella, MJBostrom, LLKnabb, RMWong, PCWright, MRWexler, RR Isoxazolines and isoxazoles as factor Xa inhibitors. Bioorg Med Chem Lett10:685-9 (2000) Serine protease 1
Name:Serine protease 1
Type:Enzyme
Mol. Mass.:25790.52
Organism:Bos taurus (bovine)
Description:P00760
Residue:246
BDBM50087536
NameBDBM50087536
Synonyms:3-(3-Carbamimidoyl-phenyl)-isoxazole-4-carboxylic acid (2'-methanesulfonyl-biphenyl-4-yl)-amide | CHEMBL159816
TypeSmall organic molecule
Emp. Form.C24H20N4O4S
Mol. Mass.460.505
SMILESCS(=O)(=O)c1ccccc1-c1ccc(NC(=O)c2conc2-c2cccc(c2)C(N)=N)cc1